Reaction Details
TargetDelta-type opioid receptor
LigandBDBM50210397
Substrate/Competitorn/a
Meas. Tech.ChEMBL_438624 (CHEMBL888955)
Ki 550±n/a nM
Citation Ho, GDBercovici, ATulshian, DGreenlee, WJFawzi, ASmith Torhan, AZhang, H Synthesis and structure-activity relationships of 4-hydroxy-4-phenylpiperidines as nociceptin receptor ligands: Part 1. Bioorg Med Chem Lett17:3023-7 (2007) 
 
Delta-type opioid receptor
Name:Delta-type opioid receptor
Type:G Protein-Coupled Receptor (GPCR)
Mol. Mass.:40382.98
Organism:Homo sapiens (Human)
Description:Competition binding assays were carried out using membrane preparations from transfected HN9.10 cells that constitutively expressed the delta opioid receptor.
Residue:372
BDBM50210397
NameBDBM50210397
Synonyms:4-phenyl-1-(1-phenylheptyl)piperidin-4-ol | CHEMBL231607
TypeSmall organic molecule
Emp. Form.C24H33NO
Mol. Mass.351.5249
SMILESCCCCCCC(N1CCC(O)(CC1)c1ccccc1)c1ccccc1