Reaction Details
TargetNociceptin receptor
LigandBDBM50210387
Substrate/Competitorn/a
Meas. Tech.ChEMBL_438633 (CHEMBL888964)
EC50 114±n/a nM
Citation Ho, GDBercovici, ATulshian, DGreenlee, WJFawzi, ASmith Torhan, AZhang, H Synthesis and structure-activity relationships of 4-hydroxy-4-phenylpiperidines as nociceptin receptor ligands: Part 1. Bioorg Med Chem Lett17:3023-7 (2007) 
 
Nociceptin receptor
Name:Nociceptin receptor
Type:G Protein-Coupled Receptor (GPCR)
Mol. Mass.:40702.87
Organism:Homo sapiens (Human)
Description:P41146
Residue:370
BDBM50210387
NameBDBM50210387
Synonyms:1-(dio-tolylmethyl)-4-phenylpiperidin-4-ol | CHEMBL389665
TypeSmall organic molecule
Emp. Form.C26H29NO
Mol. Mass.371.5146
SMILESCc1ccccc1C(N1CCC(O)(CC1)c1ccccc1)c1ccccc1C