Reaction Details
TargetKappa-type opioid receptor
LigandBDBM50210378
Substrate/Competitorn/a
Meas. Tech.ChEMBL_438623 (CHEMBL888954)
Ki 488±n/a nM
Citation Ho, GDBercovici, ATulshian, DGreenlee, WJFawzi, ASmith Torhan, AZhang, H Synthesis and structure-activity relationships of 4-hydroxy-4-phenylpiperidines as nociceptin receptor ligands: Part 1. Bioorg Med Chem Lett17:3023-7 (2007) 
 
Kappa-type opioid receptor
Name:Kappa-type opioid receptor
Type:G Protein-Coupled Receptor (GPCR)
Mol. Mass.:42648.76
Organism:Homo sapiens (Human)
Description:P41145
Residue:380
BDBM50210378
NameBDBM50210378
Synonyms:1-benzhydryl-4-ethoxy-4-phenylpiperidine | CHEMBL229016
TypeSmall organic molecule
Emp. Form.C26H29NO
Mol. Mass.371.5146
SMILESCCOC1(CCN(CC1)C(c1ccccc1)c1ccccc1)c1ccccc1