Reaction Details
TargetMu-type opioid receptor
LigandBDBM50210382
Substrate/Competitorn/a
Meas. Tech.ChEMBL_438625 (CHEMBL888956)
Ki 2864±n/a nM
Citation Ho, GDBercovici, ATulshian, DGreenlee, WJFawzi, ASmith Torhan, AZhang, H Synthesis and structure-activity relationships of 4-hydroxy-4-phenylpiperidines as nociceptin receptor ligands: Part 1. Bioorg Med Chem Lett17:3023-7 (2007) 
 
Mu-type opioid receptor
Name:Mu-type opioid receptor
Type:G Protein-Coupled Receptor (GPCR)
Mol. Mass.:44789.51
Organism:Homo sapiens (Human)
Description:P35372
Residue:400
BDBM50210382
NameBDBM50210382
Synonyms:2-((4-hydroxy-4-phenylpiperidin-1-yl)(phenyl)methyl)benzoic acid | CHEMBL437742
TypeSmall organic molecule
Emp. Form.C25H25NO3
Mol. Mass.387.4709
SMILESOC(=O)c1ccccc1C(N1CCC(O)(CC1)c1ccccc1)c1ccccc1