Reaction Details
TargetKappa-type opioid receptor
LigandBDBM50210398
Substrate/Competitorn/a
Meas. Tech.ChEMBL_438623 (CHEMBL888954)
Ki 1479±n/a nM
Citation Ho, GDBercovici, ATulshian, DGreenlee, WJFawzi, ASmith Torhan, AZhang, H Synthesis and structure-activity relationships of 4-hydroxy-4-phenylpiperidines as nociceptin receptor ligands: Part 1. Bioorg Med Chem Lett17:3023-7 (2007) 
 
Kappa-type opioid receptor
Name:Kappa-type opioid receptor
Type:G Protein-Coupled Receptor (GPCR)
Mol. Mass.:42648.76
Organism:Homo sapiens (Human)
Description:P41145
Residue:380
BDBM50210398
NameBDBM50210398
Synonyms:1-((2-fluorophenyl)(phenyl)methyl)-4-phenylpiperidin-4-ol | CHEMBL228802
TypeSmall organic molecule
Emp. Form.C24H24FNO
Mol. Mass.361.4519
SMILESOC1(CCN(CC1)C(c1ccccc1)c1ccccc1F)c1ccccc1