Reaction Details
TargetNociceptin receptor
LigandBDBM50210375
Substrate/Competitorn/a
Meas. Tech.ChEMBL_438633 (CHEMBL888964)
Ki 2±n/a nM
Citation Ho, GDBercovici, ATulshian, DGreenlee, WJFawzi, ASmith Torhan, AZhang, H Synthesis and structure-activity relationships of 4-hydroxy-4-phenylpiperidines as nociceptin receptor ligands: Part 1. Bioorg Med Chem Lett17:3023-7 (2007) 
 
Nociceptin receptor
Name:Nociceptin receptor
Type:G Protein-Coupled Receptor (GPCR)
Mol. Mass.:40702.87
Organism:Homo sapiens (Human)
Description:P41146
Residue:370
BDBM50210375
NameBDBM50210375
Synonyms:1-(bis(2-chlorophenyl)methyl)-4-phenylpiperidin-4-ol | CHEMBL228911
TypeSmall organic molecule
Emp. Form.C24H23Cl2NO
Mol. Mass.412.352
SMILESOC1(CCN(CC1)C(c1ccccc1Cl)c1ccccc1Cl)c1ccccc1