Reaction Details
TargetNociceptin receptor
LigandBDBM50210383
Substrate/Competitorn/a
Meas. Tech.ChEMBL_438633 (CHEMBL888964)
Ki 23±n/a nM
Citation Ho, GDBercovici, ATulshian, DGreenlee, WJFawzi, ASmith Torhan, AZhang, H Synthesis and structure-activity relationships of 4-hydroxy-4-phenylpiperidines as nociceptin receptor ligands: Part 1. Bioorg Med Chem Lett17:3023-7 (2007) 
 
Nociceptin receptor
Name:Nociceptin receptor
Type:G Protein-Coupled Receptor (GPCR)
Mol. Mass.:40702.87
Organism:Homo sapiens (Human)
Description:P41146
Residue:370
BDBM50210383
NameBDBM50210383
Synonyms:4-phenyl-1-(phenyl(o-tolyl)methyl)piperidin-4-ol CHEMBL535844 | CHEMBL541636
TypeSmall organic molecule
Emp. Form.C25H27NO
Mol. Mass.357.488
SMILESCc1ccccc1C(N1CCC(O)(CC1)c1ccccc1)c1ccccc1