Reaction Details
TargetMu-type opioid receptor
LigandBDBM50210414
Substrate/Competitorn/a
Meas. Tech.ChEMBL_438625 (CHEMBL888956)
Ki 201±n/a nM
Citation Ho, GDBercovici, ATulshian, DGreenlee, WJFawzi, ASmith Torhan, AZhang, H Synthesis and structure-activity relationships of 4-hydroxy-4-phenylpiperidines as nociceptin receptor ligands: Part 1. Bioorg Med Chem Lett17:3023-7 (2007) 
 
Mu-type opioid receptor
Name:Mu-type opioid receptor
Type:G Protein-Coupled Receptor (GPCR)
Mol. Mass.:44789.51
Organism:Homo sapiens (Human)
Description:P35372
Residue:400
BDBM50210414
NameBDBM50210414
Synonyms:1-((3-chlorophenyl)(phenyl)methyl)-4-phenylpiperidin-4-ol | CHEMBL390498
TypeSmall organic molecule
Emp. Form.C24H24ClNO
Mol. Mass.377.906
SMILESOC1(CCN(CC1)C(c1ccccc1)c1cccc(Cl)c1)c1ccccc1