Reaction Details
TargetNociceptin receptor
LigandBDBM50210408
Substrate/Competitorn/a
Meas. Tech.ChEMBL_438633 (CHEMBL888964)
Ki 295±n/a nM
Citation Ho, GDBercovici, ATulshian, DGreenlee, WJFawzi, ASmith Torhan, AZhang, H Synthesis and structure-activity relationships of 4-hydroxy-4-phenylpiperidines as nociceptin receptor ligands: Part 1. Bioorg Med Chem Lett17:3023-7 (2007) 
 
Nociceptin receptor
Name:Nociceptin receptor
Type:G Protein-Coupled Receptor (GPCR)
Mol. Mass.:40702.87
Organism:Homo sapiens (Human)
Description:P41146
Residue:370
BDBM50210408
NameBDBM50210408
Synonyms:1-(2-methoxy-1-phenylethyl)-4-phenylpiperidin-4-ol | CHEMBL228686
TypeSmall organic molecule
Emp. Form.C20H25NO2
Mol. Mass.311.418
SMILESCOCC(N1CCC(O)(CC1)c1ccccc1)c1ccccc1