Reaction Details
TargetKappa-type opioid receptor
LigandBDBM50210392
Substrate/Competitorn/a
Meas. Tech.ChEMBL_438623 (CHEMBL888954)
Ki 1095±n/a nM
Citation Ho, GDBercovici, ATulshian, DGreenlee, WJFawzi, ASmith Torhan, AZhang, H Synthesis and structure-activity relationships of 4-hydroxy-4-phenylpiperidines as nociceptin receptor ligands: Part 1. Bioorg Med Chem Lett17:3023-7 (2007) 
 
Kappa-type opioid receptor
Name:Kappa-type opioid receptor
Type:G Protein-Coupled Receptor (GPCR)
Mol. Mass.:42648.76
Organism:Homo sapiens (Human)
Description:P41145
Residue:380
BDBM50210392
NameBDBM50210392
Synonyms:4-phenyl-1-(phenyl(m-tolyl)methyl)piperidin-4-ol | CHEMBL390279
TypeSmall organic molecule
Emp. Form.C25H27NO
Mol. Mass.357.488
SMILESCc1cccc(c1)C(N1CCC(O)(CC1)c1ccccc1)c1ccccc1