Reaction Details
TargetKappa-type opioid receptor
LigandBDBM50210403
Substrate/Competitorn/a
Meas. Tech.ChEMBL_438623 (CHEMBL888954)
Ki 288±n/a nM
Citation Ho, GDBercovici, ATulshian, DGreenlee, WJFawzi, ASmith Torhan, AZhang, H Synthesis and structure-activity relationships of 4-hydroxy-4-phenylpiperidines as nociceptin receptor ligands: Part 1. Bioorg Med Chem Lett17:3023-7 (2007) 
 
Kappa-type opioid receptor
Name:Kappa-type opioid receptor
Type:G Protein-Coupled Receptor (GPCR)
Mol. Mass.:42648.76
Organism:Homo sapiens (Human)
Description:P41145
Residue:380
BDBM50210403
NameBDBM50210403
Synonyms:1-(1,2-diphenylethyl)-4-phenylpiperidin-4-ol | CHEMBL397945
TypeSmall organic molecule
Emp. Form.C25H27NO
Mol. Mass.357.488
SMILESOC1(CCN(CC1)C(Cc1ccccc1)c1ccccc1)c1ccccc1