Reaction Details
TargetNociceptin receptor
LigandBDBM50210418
Substrate/Competitorn/a
Meas. Tech.ChEMBL_438633 (CHEMBL888964)
Ki 14±n/a nM
Citation Ho, GDBercovici, ATulshian, DGreenlee, WJFawzi, ASmith Torhan, AZhang, H Synthesis and structure-activity relationships of 4-hydroxy-4-phenylpiperidines as nociceptin receptor ligands: Part 1. Bioorg Med Chem Lett17:3023-7 (2007) 
 
Nociceptin receptor
Name:Nociceptin receptor
Type:G Protein-Coupled Receptor (GPCR)
Mol. Mass.:40702.87
Organism:Homo sapiens (Human)
Description:P41146
Residue:370
BDBM50210418
NameBDBM50210418
Synonyms:4-phenyl-1-(1-phenylhexyl)piperidin-4-ol | CHEMBL230253
TypeSmall organic molecule
Emp. Form.C23H31NO
Mol. Mass.337.4983
SMILESCCCCCC(N1CCC(O)(CC1)c1ccccc1)c1ccccc1