Reaction Details
TargetNociceptin receptor
LigandBDBM50210394
Substrate/Competitorn/a
Meas. Tech.ChEMBL_438633 (CHEMBL888964)
Ki 9±n/a nM
Citation Ho, GDBercovici, ATulshian, DGreenlee, WJFawzi, ASmith Torhan, AZhang, H Synthesis and structure-activity relationships of 4-hydroxy-4-phenylpiperidines as nociceptin receptor ligands: Part 1. Bioorg Med Chem Lett17:3023-7 (2007) 
 
Nociceptin receptor
Name:Nociceptin receptor
Type:G Protein-Coupled Receptor (GPCR)
Mol. Mass.:40702.87
Organism:Homo sapiens (Human)
Description:P41146
Residue:370
BDBM50210394
NameBDBM50210394
Synonyms:1-((2-(hydroxymethyl)phenyl)(phenyl)methyl)-4-phenylpiperidin-4-ol | CHEMBL228858
TypeSmall organic molecule
Emp. Form.C25H27NO2
Mol. Mass.373.4874
SMILESOCc1ccccc1C(N1CCC(O)(CC1)c1ccccc1)c1ccccc1