Reaction Details
TargetKappa-type opioid receptor
LigandBDBM50210405
Substrate/Competitorn/a
Meas. Tech.ChEMBL_438623 (CHEMBL888954)
Ki 245±n/a nM
Citation Ho, GDBercovici, ATulshian, DGreenlee, WJFawzi, ASmith Torhan, AZhang, H Synthesis and structure-activity relationships of 4-hydroxy-4-phenylpiperidines as nociceptin receptor ligands: Part 1. Bioorg Med Chem Lett17:3023-7 (2007) 
 
Kappa-type opioid receptor
Name:Kappa-type opioid receptor
Type:G Protein-Coupled Receptor (GPCR)
Mol. Mass.:42648.76
Organism:Homo sapiens (Human)
Description:P41145
Residue:380
BDBM50210405
NameBDBM50210405
Synonyms:4-phenyl-1-(1-phenylbutyl)piperidin-4-ol | CHEMBL230145
TypeSmall organic molecule
Emp. Form.C21H27NO
Mol. Mass.309.4452
SMILESCCCC(N1CCC(O)(CC1)c1ccccc1)c1ccccc1