Reaction Details
TargetKappa-type opioid receptor
LigandBDBM50210377
Substrate/Competitorn/a
Meas. Tech.ChEMBL_438623 (CHEMBL888954)
Ki 36±n/a nM
Citation Ho, GDBercovici, ATulshian, DGreenlee, WJFawzi, ASmith Torhan, AZhang, H Synthesis and structure-activity relationships of 4-hydroxy-4-phenylpiperidines as nociceptin receptor ligands: Part 1. Bioorg Med Chem Lett17:3023-7 (2007) 
 
Kappa-type opioid receptor
Name:Kappa-type opioid receptor
Type:G Protein-Coupled Receptor (GPCR)
Mol. Mass.:42648.76
Organism:Homo sapiens (Human)
Description:P41145
Residue:380
BDBM50210377
NameBDBM50210377
Synonyms:4-phenyl-1-(1-phenylpentyl)piperidin-4-ol | CHEMBL390882
TypeSmall organic molecule
Emp. Form.C22H29NO
Mol. Mass.323.4718
SMILESCCCCC(N1CCC(O)(CC1)c1ccccc1)c1ccccc1