Reaction Details
TargetC-X-C chemokine receptor type 3
LigandBDBM50211116
Substrate/Competitorn/a
Meas. Tech.ChEMBL_438654 (CHEMBL888985)
IC50>10000±n/a nM
Citation Johnson, MLi, ARLiu, JFu, ZZhu, LMiao, SWang, XXu, QHuang, AMarcus, AXu, FEbsworth, KSablan, EDanao, JKumer, JDairaghi, DLawrence, CSullivan, TTonn, GSchall, TCollins, TMedina, J Discovery and optimization of a series of quinazolinone-derived antagonists of CXCR3. Bioorg Med Chem Lett17:3339-43 (2007) 
 
C-X-C chemokine receptor type 3
Name:C-X-C chemokine receptor type 3
Type:Enzyme Catalytic Domain
Mol. Mass.:40665.65
Organism:Homo sapiens (Human)
Description:n/a
Residue:368
BDBM50211116
NameBDBM50211116
Synonyms:(R)-N-(2-(dimethylamino)ethyl)-N-(1-(3-(4-fluorophenyl)-4-oxo-3,4-dihydroquinazolin-2-yl)ethyl)-2-p-tolylacetamide | CHEMBL230237
TypeSmall organic molecule
Emp. Form.C29H31FN4O2
Mol. Mass.486.5804
SMILESC[C@@H](N(CCN(C)C)C(=O)Cc1ccc(C)cc1)c1nc2ccccc2c(=O)n1-c1ccc(F)cc1