Reaction Details
TargetC-X-C chemokine receptor type 3
LigandBDBM50167778
Substrate/Competitorn/a
Meas. Tech.ChEMBL_438654 (CHEMBL888985)
IC50 250±n/a nM
Citation Johnson, MLi, ARLiu, JFu, ZZhu, LMiao, SWang, XXu, QHuang, AMarcus, AXu, FEbsworth, KSablan, EDanao, JKumer, JDairaghi, DLawrence, CSullivan, TTonn, GSchall, TCollins, TMedina, J Discovery and optimization of a series of quinazolinone-derived antagonists of CXCR3. Bioorg Med Chem Lett17:3339-43 (2007) 
 
C-X-C chemokine receptor type 3
Name:C-X-C chemokine receptor type 3
Type:Enzyme Catalytic Domain
Mol. Mass.:40665.65
Organism:Homo sapiens (Human)
Description:n/a
Residue:368
BDBM50167778
NameBDBM50167778
Synonyms:CHEMBL194494 N-(2-(dimethylamino)ethyl)-N-(1-(3-(4-fluorophenyl)-4-oxo-3,4-dihydroquinazolin-2-yl)ethyl)decanamide
TypeSmall organic molecule
Emp. Form.C30H41FN4O2
Mol. Mass.508.6705
SMILESCCCCCCCCCC(=O)N(CCN(C)C)C(C)c1nc2ccccc2c(=O)n1-c1ccc(F)cc1