Reaction Details
TargetC-X-C chemokine receptor type 3
LigandBDBM50211114
Substrate/Competitorn/a
Meas. Tech.ChEMBL_438654 (CHEMBL888985)
IC50 8±n/a nM
Citation Johnson, MLi, ARLiu, JFu, ZZhu, LMiao, SWang, XXu, QHuang, AMarcus, AXu, FEbsworth, KSablan, EDanao, JKumer, JDairaghi, DLawrence, CSullivan, TTonn, GSchall, TCollins, TMedina, J Discovery and optimization of a series of quinazolinone-derived antagonists of CXCR3. Bioorg Med Chem Lett17:3339-43 (2007) 
 
C-X-C chemokine receptor type 3
Name:C-X-C chemokine receptor type 3
Type:Enzyme Catalytic Domain
Mol. Mass.:40665.65
Organism:Homo sapiens (Human)
Description:n/a
Residue:368
BDBM50211114
NameBDBM50211114
Synonyms:(-)-(R)-N-(1-(3-(4-ethoxyphenyl)-4-oxo-3,4-dihydropyrido[2,3-d]pyrimidin-2-yl)ethyl)-N-(pyridin-3-ylmethyl)-2-(4-(trifluoromethoxy)phenyl)acetamide AMG-487 | CHEMBL397983
TypeSmall organic molecule
Emp. Form.C32H28F3N5O4
Mol. Mass.603.591
SMILESCCOc1ccc(cc1)-n1c(nc2ncccc2c1=O)[C@@H](C)N(Cc1cccnc1)C(=O)Cc1ccc(OC(F)(F)F)cc1