Reaction Details
TargetC-X-C chemokine receptor type 3
LigandBDBM50211153
Substrate/Competitorn/a
Meas. Tech.ChEMBL_438654 (CHEMBL888985)
IC50 650±n/a nM
Citation Johnson, MLi, ARLiu, JFu, ZZhu, LMiao, SWang, XXu, QHuang, AMarcus, AXu, FEbsworth, KSablan, EDanao, JKumer, JDairaghi, DLawrence, CSullivan, TTonn, GSchall, TCollins, TMedina, J Discovery and optimization of a series of quinazolinone-derived antagonists of CXCR3. Bioorg Med Chem Lett17:3339-43 (2007) 
 
C-X-C chemokine receptor type 3
Name:C-X-C chemokine receptor type 3
Type:Enzyme Catalytic Domain
Mol. Mass.:40665.65
Organism:Homo sapiens (Human)
Description:n/a
Residue:368
BDBM50211153
NameBDBM50211153
Synonyms:(R)-N-(2-(1H-imidazol-4-yl)-2-oxoethyl)-N-(1-(3-(4-fluorophenyl)-4-oxo-3,4-dihydroquinazolin-2-yl)ethyl)-2-(4-(trifluoromethyl)phenyl)acetamide | CHEMBL231485
TypeSmall organic molecule
Emp. Form.C30H23F4N5O3
Mol. Mass.577.5289
SMILESC[C@@H](N(CC(=O)c1cnc[nH]1)C(=O)Cc1ccc(cc1)C(F)(F)F)c1nc2ccccc2c(=O)n1-c1ccc(F)cc1