Reaction Details
TargetC-X-C chemokine receptor type 3
LigandBDBM50211154
Substrate/Competitorn/a
Meas. Tech.ChEMBL_438654 (CHEMBL888985)
IC50 1370±n/a nM
Citation Johnson, MLi, ARLiu, JFu, ZZhu, LMiao, SWang, XXu, QHuang, AMarcus, AXu, FEbsworth, KSablan, EDanao, JKumer, JDairaghi, DLawrence, CSullivan, TTonn, GSchall, TCollins, TMedina, J Discovery and optimization of a series of quinazolinone-derived antagonists of CXCR3. Bioorg Med Chem Lett17:3339-43 (2007) 
 
C-X-C chemokine receptor type 3
Name:C-X-C chemokine receptor type 3
Type:Enzyme Catalytic Domain
Mol. Mass.:40665.65
Organism:Homo sapiens (Human)
Description:n/a
Residue:368
BDBM50211154
NameBDBM50211154
Synonyms:(R)-4-(4-oxo-2-(1-(N-(pyridin-3-ylmethyl)-2-(4-(trifluoromethyl)phenyl)acetamido)ethyl)quinazolin-3(4H)-yl)benzoic acid | CHEMBL395748
TypeSmall organic molecule
Emp. Form.C32H25F3N4O4
Mol. Mass.586.5605
SMILESC[C@@H](N(Cc1cccnc1)C(=O)Cc1ccc(cc1)C(F)(F)F)c1nc2ccccc2c(=O)n1-c1ccc(cc1)C(O)=O