Reaction Details
TargetfMet-Leu-Phe receptor
LigandBDBM50211790
Substrate/Competitorn/a
Meas. Tech.ChEMBL_438742 (CHEMBL887899)
Ki>10000±n/a nM
Citation Bruno, OBrullo, CBondavalli, FRanise, ASchenone, SFalzarano, MSVarani, KSpisani, S 2-Phenyl-2,3-dihydro-1H-imidazo[1,2-b]pyrazole derivatives: new potent inhibitors of fMLP-induced neutrophil chemotaxis. Bioorg Med Chem Lett17:3696-701 (2007) 
 
fMet-Leu-Phe receptor
Name:fMet-Leu-Phe receptor
Type:Enzyme Catalytic Domain
Mol. Mass.:38456.14
Organism:Homo sapiens (Human)
Description:gi_4503779
Residue:350
BDBM50211790
NameBDBM50211790
Synonyms:(2-phenyl-2,3-dihydro-1H-imidazo[1,2-b]pyrazol-7-yl)(pyrrolidin-1-yl)methanone | CHEMBL438108
TypeSmall organic molecule
Emp. Form.C16H18N4O
Mol. Mass.282.3403
SMILESO=C(N1CCCC1)c1cnn2CC(Nc12)c1ccccc1