Reaction Details
TargetfMet-Leu-Phe receptor
LigandBDBM50050937
Substrate/Competitorn/a
Meas. Tech.ChEMBL_438742 (CHEMBL887899)
Ki 42±n/a nM
Citation Bruno, OBrullo, CBondavalli, FRanise, ASchenone, SFalzarano, MSVarani, KSpisani, S 2-Phenyl-2,3-dihydro-1H-imidazo[1,2-b]pyrazole derivatives: new potent inhibitors of fMLP-induced neutrophil chemotaxis. Bioorg Med Chem Lett17:3696-701 (2007) 
 
fMet-Leu-Phe receptor
Name:fMet-Leu-Phe receptor
Type:Enzyme Catalytic Domain
Mol. Mass.:38456.14
Organism:Homo sapiens (Human)
Description:gi_4503779
Residue:350
BDBM50050937
NameBDBM50050937
Synonyms:(S)-2-[(S)-2-((S)-2-Formylamino-4-methylsulfanyl-butyrylamino)-4-methyl-pentanoylamino]-3-phenyl-propionic acid N-formyl-methionyl-leucyl-phenylalanine | N-formylmethionine-leucine-phenylalanine
TypeSmall organic molecule
Emp. Form.C21H31N3O5S
Mol. Mass.437.553
SMILESCSCC[C@H](NC=O)C(=O)N[C@@H](CC(C)C)C(=O)N[C@@H](Cc1ccccc1)C(O)=O