Reaction Details
TargetfMet-Leu-Phe receptor
LigandBDBM50211797
Substrate/Competitorn/a
Meas. Tech.ChEMBL_438742 (CHEMBL887899)
Ki>10000±n/a nM
Citation Bruno, OBrullo, CBondavalli, FRanise, ASchenone, SFalzarano, MSVarani, KSpisani, S 2-Phenyl-2,3-dihydro-1H-imidazo[1,2-b]pyrazole derivatives: new potent inhibitors of fMLP-induced neutrophil chemotaxis. Bioorg Med Chem Lett17:3696-701 (2007) 
 
fMet-Leu-Phe receptor
Name:fMet-Leu-Phe receptor
Type:Enzyme Catalytic Domain
Mol. Mass.:38456.14
Organism:Homo sapiens (Human)
Description:gi_4503779
Residue:350
BDBM50211797
NameBDBM50211797
Synonyms:2-phenyl-2,3-dihydro-1H-imidazo[1,2-b]pyrazole | CHEMBL231618
TypeSmall organic molecule
Emp. Form.C11H11N3
Mol. Mass.185.2251
SMILESC1C(Nc2ccnn12)c1ccccc1