Reaction Details
TargetPhosphoenolpyruvate carboxykinase, cytosolic [GTP]
LigandBDBM50133801
Substrate/Competitorn/a
Meas. Tech.ChEMBL_438958 (CHEMBL889301)
EC50 8600±n/a nM
Citation Pietranico, SLFoley, LHHuby, NYun, WDunten, PVermeulen, JWang, PToth, KRamsey, GGubler, MLWertheimer, SJ C-8 Modifications of 3-alkyl-1,8-dibenzylxanthines as inhibitors of human cytosolic phosphoenolpyruvate carboxykinase. Bioorg Med Chem Lett17:3835-9 (2007) 
 
Phosphoenolpyruvate carboxykinase, cytosolic [GTP]
Name:Phosphoenolpyruvate carboxykinase, cytosolic [GTP]
Type:Protein
Mol. Mass.:69414.48
Organism:Rattus norvegicus (Rat)
Description:n/a
Residue:622
BDBM50133801
NameBDBM50133801
Synonyms:CHEMBL120708 N-{4-[1-(2-FLUOROBENZYL)-3-BUTYL-2,6-DIOXO-2,3,6,7-TETRAHYDRO-1H-PURIN-8-YLMETHYL]-PHENYL}-ACETAMIDE | N-{4-[3-Butyl-1-(2-fluoro-benzyl)-2,6-dioxo-2,3,6,7-tetrahydro-1H-purin-8-ylmethyl]-phenyl}-acetamide
TypeSmall organic molecule
Emp. Form.C25H26FN5O3
Mol. Mass.463.504
SMILESCCCCn1c2nc(Cc3ccc(NC(C)=O)cc3)[nH]c2c(=O)n(Cc2ccccc2F)c1=O