Reaction Details
TargetPhosphoenolpyruvate carboxykinase, cytosolic [GTP]
LigandBDBM50214004
Substrate/Competitorn/a
Meas. Tech.ChEMBL_438958 (CHEMBL889301)
EC50 3970±n/a nM
Citation Pietranico, SLFoley, LHHuby, NYun, WDunten, PVermeulen, JWang, PToth, KRamsey, GGubler, MLWertheimer, SJ C-8 Modifications of 3-alkyl-1,8-dibenzylxanthines as inhibitors of human cytosolic phosphoenolpyruvate carboxykinase. Bioorg Med Chem Lett17:3835-9 (2007) 
 
Phosphoenolpyruvate carboxykinase, cytosolic [GTP]
Name:Phosphoenolpyruvate carboxykinase, cytosolic [GTP]
Type:Protein
Mol. Mass.:69414.48
Organism:Rattus norvegicus (Rat)
Description:n/a
Residue:622
BDBM50214004
NameBDBM50214004
Synonyms:CHEMBL243116 | N-(4-((1-(2-fluorobenzyl)-3-butyl-2,6-dioxo-2,3,6,7-tetrahydro-1H-purin-8-yl)methyl)phenyl)-5-chloro-1,3-dimethyl-1H-pyrazole-4-sulfonamide
TypeSmall organic molecule
Emp. Form.C28H29ClFN7O4S
Mol. Mass.614.091
SMILESCCCCn1c2nc(Cc3ccc(NS(=O)(=O)c4c(C)nn(C)c4Cl)cc3)[nH]c2c(=O)n(Cc2ccccc2F)c1=O