Reaction Details
TargetPotassium voltage-gated channel subfamily H member 2
LigandBDBM50001884
Substrate/Competitorn/a
Meas. Tech.ChEMBL_438966 (CHEMBL889314)
Ki 4060±n/a nM
Citation Singleton, DHBoyd, HSteidl-Nichols, JVDeacon, MGroot, MJPrice, DNettleton, DOWallace, NKTroutman, MDWilliams, CBoyd, JG Fluorescently labeled analogues of dofetilide as high-affinity fluorescence polarization ligands for the human ether-a-go-go-related gene (hERG) channel. J Med Chem50:2931-41 (2007) 
 
Potassium voltage-gated channel subfamily H member 2
Name:Potassium voltage-gated channel subfamily H member 2
Type:Multi-pass membrane protein
Mol. Mass.:126672.65
Organism:Homo sapiens (Human)
Description:Q12809
Residue:1159
BDBM50001884
NameBDBM50001884
Synonyms:2-[4-(4-Methyl-benzyl)-piperazin-1-yl]-1-(2-methyl-2,3-dihydro-indol-1-yl)-ethanone 3-chloro-6-(4-methyl-piperazin-1-yl)-5H-dibenzo[b,e][1,4]diazepine 8-Chloro-11-(4-methyl-piperazin-1-yl)-5H-dibenzo[b,e][1,4]diazepine( Clozepine ) 8-Chloro-11-(4-methyl-piperazin-1-yl)-5H-dibenzo[b,e][1,4]diazepine(Clopazine) 8-chloro-11-(4-methylpiperazin-1-yl)-5H-dibenzo[b,e][1,4]diazepine CHEMBL538973 CLOZAPINE, 8-CHLORO-11-(4-METHYL-PIPERAZIN-1-YL)-5H-DIBENZO[B,E][1,4]DIAZEPINE HF 1854 US10752588, Compound Clozapine | US11498896, Compound Clozapine
TypeSmall organic molecule
Emp. Form.C18H19ClN4
Mol. Mass.326.823
SMILESCN1CCN(CC1)C1=Nc2cc(Cl)ccc2Nc2ccccc12