Reaction Details
TargetPotassium voltage-gated channel subfamily H member 2
LigandBDBM50214367
Substrate/Competitorn/a
Meas. Tech.ChEMBL_438965 (CHEMBL889315)
Ki>1000±n/a nM
Citation Singleton, DHBoyd, HSteidl-Nichols, JVDeacon, MGroot, MJPrice, DNettleton, DOWallace, NKTroutman, MDWilliams, CBoyd, JG Fluorescently labeled analogues of dofetilide as high-affinity fluorescence polarization ligands for the human ether-a-go-go-related gene (hERG) channel. J Med Chem50:2931-41 (2007) 
 
Potassium voltage-gated channel subfamily H member 2
Name:Potassium voltage-gated channel subfamily H member 2
Type:Multi-pass membrane protein
Mol. Mass.:126672.65
Organism:Homo sapiens (Human)
Description:Q12809
Residue:1159
BDBM50214367
NameBDBM50214367
Synonyms:(2-(N-ethylamidomethyl)-6,7,9,10,16,18-hexahydro-16,16,-18,18-tetramethyl-14-sulfopyrano[3'',2'':3:4;5'',6'':3',4']dipyrido-[1,2-a:1',2'-a']diindol-5-ium ethylamide | CHEMBL374836
TypeSmall organic molecule
Emp. Form.C33H39N3O5S
Mol. Mass.589.745
SMILESCCNC(=O)Cc1ccc2N3CCC4OC5CC[N+]6=C(C5=CC4C3C(C)(C)c2c1)C(C)(C)c1cc(ccc61)S([O-])(=O)=O