Reaction Details
TargetPotassium voltage-gated channel subfamily H member 2
LigandBDBM50214375
Substrate/Competitorn/a
Meas. Tech.ChEMBL_438965 (CHEMBL889315)
Ki 980±n/a nM
Citation Singleton, DHBoyd, HSteidl-Nichols, JVDeacon, MGroot, MJPrice, DNettleton, DOWallace, NKTroutman, MDWilliams, CBoyd, JG Fluorescently labeled analogues of dofetilide as high-affinity fluorescence polarization ligands for the human ether-a-go-go-related gene (hERG) channel. J Med Chem50:2931-41 (2007) 
 
Potassium voltage-gated channel subfamily H member 2
Name:Potassium voltage-gated channel subfamily H member 2
Type:Multi-pass membrane protein
Mol. Mass.:126672.65
Organism:Homo sapiens (Human)
Description:Q12809
Residue:1159
BDBM50214375
NameBDBM50214375
Synonyms:3',6'-dihydroxy-N-[2-(4-methanesulfonamidophenoxy)ethyl]-N-[2-(4-methanesulfonamidophenyl)ethyl]-3-oxo-3H-spiro[2-benzofuran-1,9'-xanthene]-5-carboxamide | CHEMBL390300
TypeSmall organic molecule
Emp. Form.C39H35N3O11S2
Mol. Mass.785.839
SMILESCS(=O)(=O)Nc1ccc(CCN(CCOc2ccc(NS(C)(=O)=O)cc2)C(=O)c2ccc3c(c2)C(=O)OC32c3ccc(O)cc3Oc3cc(O)ccc23)cc1