Reaction Details
TargetPotassium voltage-gated channel subfamily H member 2
LigandBDBM50214370
Substrate/Competitorn/a
Meas. Tech.ChEMBL_438965 (CHEMBL889315)
Ki 0.39±n/a nM
Citation Singleton, DHBoyd, HSteidl-Nichols, JVDeacon, MGroot, MJPrice, DNettleton, DOWallace, NKTroutman, MDWilliams, CBoyd, JG Fluorescently labeled analogues of dofetilide as high-affinity fluorescence polarization ligands for the human ether-a-go-go-related gene (hERG) channel. J Med Chem50:2931-41 (2007) 
 
Potassium voltage-gated channel subfamily H member 2
Name:Potassium voltage-gated channel subfamily H member 2
Type:Multi-pass membrane protein
Mol. Mass.:126672.65
Organism:Homo sapiens (Human)
Description:Q12809
Residue:1159
BDBM50214370
NameBDBM50214370
Synonyms:CHEMBL227134 | N-(4-{2-[[2-(4-methanesulfonylaminophenoxy)ethyl](7-nitrobenzo[1,2,5]oxadiazol-4-yl)amino]ethyl}phenyl)-methanesulfonamide
TypeSmall organic molecule
Emp. Form.C24H26N6O8S2
Mol. Mass.590.629
SMILESCS(=O)(=O)Nc1ccc(CCN(CCOc2ccc(NS(C)(=O)=O)cc2)c2ccc([N+]([O-])=O)c3nonc23)cc1