Reaction Details
TargetPotassium voltage-gated channel subfamily H member 2
LigandBDBM50214372
Substrate/Competitorn/a
Meas. Tech.ChEMBL_438968 (CHEMBL889312)
IC50 310±n/a nM
Citation Singleton, DHBoyd, HSteidl-Nichols, JVDeacon, MGroot, MJPrice, DNettleton, DOWallace, NKTroutman, MDWilliams, CBoyd, JG Fluorescently labeled analogues of dofetilide as high-affinity fluorescence polarization ligands for the human ether-a-go-go-related gene (hERG) channel. J Med Chem50:2931-41 (2007) 
 
Potassium voltage-gated channel subfamily H member 2
Name:Potassium voltage-gated channel subfamily H member 2
Type:Multi-pass membrane protein
Mol. Mass.:126672.65
Organism:Homo sapiens (Human)
Description:Q12809
Residue:1159
BDBM50214372
NameBDBM50214372
Synonyms:24-{[(6-{[2-(4-methanesulfonamidophenoxy)ethyl][2-(4-methanesulfonamidophenyl)ethyl]amino}hexyl)carbamoyl]methyl}-5,5,27,27-tetramethyl-16-oxa-12,20-diazaheptacyclo[15.11.0.0^{3,15}.0^{4,12}.0^{6,11}.0^{20,28}.0^{21,26}]octacosa-1(28),4(12),6(11),7,9,21(26),22,24-octaen-12-ylium-8-sulfonate | CHEMBL227000
TypeSmall organic molecule
Emp. Form.C55H70N6O10S3
Mol. Mass.1071.374
SMILESCC1(C)C2=C3CC4C(CC[N+]5=C4C(C)(C)c4cc(ccc54)S([O-])(=O)=O)OC3CCN2c2ccc(CC(=O)NCCCCCCN(CCOc3ccc(NS(C)(=O)=O)cc3)CCc3ccc(NS(C)(=O)=O)cc3)cc12