Reaction Details
TargetDelta-type opioid receptor
LigandBDBM50027232
Substrate/Competitorn/a
Meas. Tech.ChEMBL_439881 (CHEMBL890202)
Ki>10000±n/a nM
Citation Simpson, DSKatavic, PLLozama, AHarding, WWParrish, DDeschamps, JRDersch, CMPartilla, JSRothman, RBNavarro, HPrisinzano, TE Synthetic studies of neoclerodane diterpenes from Salvia divinorum: preparation and opioid receptor activity of salvinicin analogues. J Med Chem50:3596-603 (2007) 
 
Delta-type opioid receptor
Name:Delta-type opioid receptor
Type:G Protein-Coupled Receptor (GPCR)
Mol. Mass.:40382.98
Organism:Homo sapiens (Human)
Description:Competition binding assays were carried out using membrane preparations from transfected HN9.10 cells that constitutively expressed the delta opioid receptor.
Residue:372
BDBM50027232
NameBDBM50027232
Synonyms:Salvinicin A
TypeSmall organic molecule
Emp. Form.C25H36O12
Mol. Mass.528.5461
SMILES[H][C@]1(C[C@@]2(C)[C@@]([H])(CC[C@@]3(C)[C@@H](C[C@H](OC(C)=O)C(=O)[C@]23[H])C(=O)OC)C(=O)O1)[C@@]1(O)[C@H](O)[C@@H](OC)O[C@H]1OC