Reaction Details
TargetDelta-type opioid receptor
LigandBDBM50027233
Substrate/Competitorn/a
Meas. Tech.ChEMBL_439881 (CHEMBL890202)
Ki>10000±n/a nM
Citation Simpson, DSKatavic, PLLozama, AHarding, WWParrish, DDeschamps, JRDersch, CMPartilla, JSRothman, RBNavarro, HPrisinzano, TE Synthetic studies of neoclerodane diterpenes from Salvia divinorum: preparation and opioid receptor activity of salvinicin analogues. J Med Chem50:3596-603 (2007) 
 
Delta-type opioid receptor
Name:Delta-type opioid receptor
Type:G Protein-Coupled Receptor (GPCR)
Mol. Mass.:40382.98
Organism:Homo sapiens (Human)
Description:Competition binding assays were carried out using membrane preparations from transfected HN9.10 cells that constitutively expressed the delta opioid receptor.
Residue:372
BDBM50027233
NameBDBM50027233
Synonyms:Salvinicin B
TypeSmall organic molecule
Emp. Form.C26H38O11
Mol. Mass.526.5733
SMILES[H][C@@]1(CC(=O)[C@]2([H])CC[C@@]3(C)[C@@H](C[C@H](OC(C)=O)C(=O)[C@]3([H])[C@@]2(C)C1)C(=O)OC)[C@@]1(O)[C@H](O)[C@H](OC)O[C@@H]1OC