Reaction Details
TargetKappa-type opioid receptor
LigandBDBM50216140
Substrate/Competitorn/a
Meas. Tech.ChEMBL_439882 (CHEMBL890203)
Ki 440±n/a nM
Citation Simpson, DSKatavic, PLLozama, AHarding, WWParrish, DDeschamps, JRDersch, CMPartilla, JSRothman, RBNavarro, HPrisinzano, TE Synthetic studies of neoclerodane diterpenes from Salvia divinorum: preparation and opioid receptor activity of salvinicin analogues. J Med Chem50:3596-603 (2007) 
 
Kappa-type opioid receptor
Name:Kappa-type opioid receptor
Type:G Protein-Coupled Receptor (GPCR)
Mol. Mass.:42648.76
Organism:Homo sapiens (Human)
Description:P41145
Residue:380
BDBM50216140
NameBDBM50216140
Synonyms:(2S,4aR,6aR,7R,9S,10aS,10bR)-methyl 9-acetoxy-2-(2-bromo-5-methoxy-2,5-dihydrofuran-3-yl)-6a,10b-dimethyl-4,10-dioxo-dodecahydro-1H-benzo[f]isochromene-7-carboxylate | CHEMBL387557
TypeSmall organic molecule
Emp. Form.C25H34O10
Mol. Mass.494.5315
SMILESCOC1OC(OC)C(=C1)[C@@H]1C[C@@]2(C)[C@@H](CC[C@@]3(C)[C@@H](C[C@H](OC(C)=O)C(=O)[C@H]23)C(=O)OC)C(=O)O1