Reaction Details
TargetKappa-type opioid receptor
LigandBDBM50216136
Substrate/Competitorn/a
Meas. Tech.ChEMBL_439882 (CHEMBL890203)
Ki 125±n/a nM
Citation Simpson, DSKatavic, PLLozama, AHarding, WWParrish, DDeschamps, JRDersch, CMPartilla, JSRothman, RBNavarro, HPrisinzano, TE Synthetic studies of neoclerodane diterpenes from Salvia divinorum: preparation and opioid receptor activity of salvinicin analogues. J Med Chem50:3596-603 (2007) 
 
Kappa-type opioid receptor
Name:Kappa-type opioid receptor
Type:G Protein-Coupled Receptor (GPCR)
Mol. Mass.:42648.76
Organism:Homo sapiens (Human)
Description:P41145
Residue:380
BDBM50216136
NameBDBM50216136
Synonyms:(2S,4aR,6aR,7R,9S,10aS,10bR)-methyl 9-acetoxy-2-((2R,3S,5S)-2,5-dimethoxy-tetrahydrofuran-3-yl)dodecahydro-6a,10b-dimethyl-4,10-dioxo-2H-naphtho[2,1-c]pyran-7-carboxylic acid methyl ester | CHEMBL226785
TypeSmall organic molecule
Emp. Form.C25H36O10
Mol. Mass.496.5473
SMILESCO[C@@H]1C[C@H]([C@H](OC)O1)[C@@H]1C[C@@]2(C)[C@@H](CC[C@@]3(C)[C@@H](C[C@H](OC(C)=O)C(=O)[C@H]23)C(=O)OC)C(=O)O1