Reaction Details
TargetKappa-type opioid receptor
LigandBDBM50216145
Substrate/Competitorn/a
Meas. Tech.ChEMBL_439882 (CHEMBL890203)
Ki>10000±n/a nM
Citation Simpson, DSKatavic, PLLozama, AHarding, WWParrish, DDeschamps, JRDersch, CMPartilla, JSRothman, RBNavarro, HPrisinzano, TE Synthetic studies of neoclerodane diterpenes from Salvia divinorum: preparation and opioid receptor activity of salvinicin analogues. J Med Chem50:3596-603 (2007) 
 
Kappa-type opioid receptor
Name:Kappa-type opioid receptor
Type:G Protein-Coupled Receptor (GPCR)
Mol. Mass.:42648.76
Organism:Homo sapiens (Human)
Description:P41145
Residue:380
BDBM50216145
NameBDBM50216145
Synonyms:CHEMBL226727 | methyl (1S,2R,7R,10R,11R,13S)-13-(acetyloxy)-4-[(2S,3R,4S,5R)-4-(acetyloxy)-3-hydroxy-2,5-dimethoxyoxolan-3-yl]-2,10-dimethyl-6,14-dioxo-5-oxatricyclo[8.4.0.0^{2,7}]tetradecane-11-carboxylate
TypeSmall organic molecule
Emp. Form.C27H38O13
Mol. Mass.570.5828
SMILESCO[C@@H]1O[C@H](OC)[C@](O)([C@@H]1OC(C)=O)C1C[C@@]2(C)[C@@H](CC[C@@]3(C)[C@@H](C[C@H](OC(C)=O)C(=O)[C@H]23)C(=O)OC)C(=O)O1