Reaction Details
TargetT-cell surface glycoprotein CD4
LigandBDBM50217022
Substrate/Competitorn/a
Meas. Tech.ChEMBL_440402 (CHEMBL890716)
Kd 27000±n/a nM
Citation Neffe, ATBilang, MGrüneberg, IMeyer, B Rational optimization of the binding affinity of CD4 targeting peptidomimetics with potential anti HIV activity. J Med Chem50:3482-8 (2007) 
 
T-cell surface glycoprotein CD4
Name:T-cell surface glycoprotein CD4
Type:PROTEIN
Mol. Mass.:51136.66
Organism:Homo sapiens (Human)
Description:ChEMBL_440402
Residue:458
BDBM50217022
NameBDBM50217022
Synonyms:CHEMBL388207 | O-((S)-1-((2S,3R)-2-(2-((S)-2-((S)-6-amino-2-(2-(naphthalen-2-yloxy)acetamido)hexanamido)-3-methylbutanamido)acetamido)-3-hydroxybutanoyl)pyrrolidin-2-yl)methyl cyclopropylcarbamothioate
TypeSmall organic molecule
Emp. Form.C38H55N7O8S
Mol. Mass.769.95
SMILESCC(C)[C@H](NC(=O)[C@H](CCCCN)NC(=O)COc1ccc2ccccc2c1)C(=O)NCC(=O)N[C@@H]([C@@H](C)O)C(=O)N1CCC[C@H]1COC(=S)NC1CC1