Reaction Details
TargetT-cell surface glycoprotein CD4
LigandBDBM50371093
Substrate/Competitorn/a
Meas. Tech.ChEMBL_440402 (CHEMBL890716)
Kd 6000000±n/a nM
Citation Neffe, ATBilang, MGrüneberg, IMeyer, B Rational optimization of the binding affinity of CD4 targeting peptidomimetics with potential anti HIV activity. J Med Chem50:3482-8 (2007) 
 
T-cell surface glycoprotein CD4
Name:T-cell surface glycoprotein CD4
Type:PROTEIN
Mol. Mass.:51136.66
Organism:Homo sapiens (Human)
Description:ChEMBL_440402
Residue:458
BDBM50371093
NameBDBM50371093
Synonyms:CHEMBL1791396
TypeSmall organic molecule
Emp. Form.C53H84N14O14S
Mol. Mass.1173.384
SMILESCSCC[C@H](NC(=O)[C@@H](N)CC(N)=O)C(=O)N[C@@H](Cc1c[nH]c2ccccc12)C(=O)N[C@@H](CCC(N)=O)C(=O)N[C@@H](CCCCN)C(=O)N[C@@H](C(C)C)C(=O)NCC(=O)N[C@@H]([C@H](C)O)C(=O)N1CCC[C@H]1C(=O)N[C@@H](CC(C)C)C(O)=O