Reaction Details
TargetT-cell surface glycoprotein CD4
LigandBDBM50217023
Substrate/Competitorn/a
Meas. Tech.ChEMBL_440402 (CHEMBL890716)
Kd 13000±n/a nM
Citation Neffe, ATBilang, MGrüneberg, IMeyer, B Rational optimization of the binding affinity of CD4 targeting peptidomimetics with potential anti HIV activity. J Med Chem50:3482-8 (2007) 
 
T-cell surface glycoprotein CD4
Name:T-cell surface glycoprotein CD4
Type:PROTEIN
Mol. Mass.:51136.66
Organism:Homo sapiens (Human)
Description:ChEMBL_440402
Residue:458
BDBM50217023
NameBDBM50217023
Synonyms:(S)-2-((2S,3R)-2-(2-((S)-2-((S)-6-amino-2-(2-(quinolin-8-yloxy)acetamido)hexanamido)-3-methylbutanamido)acetamido)-3-hydroxybutanamido)propyl tert-butylcarbamate | CHEMBL230799
TypeSmall organic molecule
Emp. Form.C36H56N8O9
Mol. Mass.744.878
SMILESCC(C)[C@H](NC(=O)[C@H](CCCCN)NC(=O)COc1cccc2cccnc12)C(=O)NCC(=O)N[C@@H]([C@@H](C)O)C(=O)N[C@@H](C)COC(=O)NC(C)(C)C