Reaction Details
TargetT-cell surface glycoprotein CD4
LigandBDBM50217028
Substrate/Competitorn/a
Meas. Tech.ChEMBL_440402 (CHEMBL890716)
Kd 26000±n/a nM
Citation Neffe, ATBilang, MGrüneberg, IMeyer, B Rational optimization of the binding affinity of CD4 targeting peptidomimetics with potential anti HIV activity. J Med Chem50:3482-8 (2007) 
 
T-cell surface glycoprotein CD4
Name:T-cell surface glycoprotein CD4
Type:PROTEIN
Mol. Mass.:51136.66
Organism:Homo sapiens (Human)
Description:ChEMBL_440402
Residue:458
BDBM50217028
NameBDBM50217028
Synonyms:CHEMBL388208 | ethyl 2-((((S)-1-((2S,3R)-2-(2-((S)-2-((S)-6-amino-2-(2-(naphthalen-2-yloxy)acetamido)hexanamido)-3-methylbutanamido)acetamido)-3-hydroxybutanoyl)pyrrolidin-2-yl)methoxy)carbonyl)acetate
TypeSmall organic molecule
Emp. Form.C39H57N7O11
Mol. Mass.799.9102
SMILESCCOC(=O)CNC(=O)OC[C@@H]1CCCN1C(=O)[C@@H](NC(=O)CNC(=O)[C@@H](NC(=O)[C@H](CCCCN)NC(=O)COc1ccc2ccccc2c1)C(C)C)[C@@H](C)O