Reaction Details
TargetCarbonic anhydrase 14
LigandBDBM12938
Substrate/Competitorn/a
Meas. Tech.ChEMBL_441220 (CHEMBL891444)
Ki 134±n/a nM
Citation Wilkinson, BLBornaghi, LFHouston, TAInnocenti, AVullo, DSupuran, CTPoulsen, SA Inhibition of membrane-associated carbonic anhydrase isozymes IX, XII and XIV with a library of glycoconjugate benzenesulfonamides. Bioorg Med Chem Lett17:987-92 (2007) 
 
Carbonic anhydrase 14
Name:Carbonic anhydrase 14
Type:Enzyme
Mol. Mass.:37665.67
Organism:Homo sapiens (Human)
Description:Human (cloned) isozyme.
Residue:337
BDBM12938
NameBDBM12938
Synonyms:4-({[4-(Aminosulfonyl)benzoyl]amino}methyl-1-(hepta-O-acetyl-beta-D-maltosyl)-1H-1,2,3-triazole Glycoconjugate Benzene Sulfonamide 2f | [(2R,3R,4S,5R,6R)-4,5-bis(acetyloxy)-6-(4-{[(4-sulfamoylphenyl)formamido]methyl}-1H-1,2,3-triazol-1-yl)-3-{[(2R,3R,4S,5R,6R)-3,4,5-tris(acetyloxy)-6-[(acetyloxy)methyl]oxan-2-yl]oxy}oxan-2-yl]methyl acetate
TypeSmall organic molecule
Emp. Form.C36H45N5O20S
Mol. Mass.899.829
SMILESCC(=O)OC[C@H]1O[C@H]([C@H](OC(C)=O)[C@@H](OC(C)=O)[C@@H]1O[C@H]1O[C@H](COC(C)=O)[C@@H](OC(C)=O)[C@H](OC(C)=O)[C@H]1OC(C)=O)n1cc(CNC(=O)c2ccc(cc2)S(N)(=O)=O)nn1