Reaction Details
TargetCarbonic anhydrase 14
LigandBDBM12924
Substrate/Competitorn/a
Meas. Tech.ChEMBL_441220 (CHEMBL891444)
Ki 64±n/a nM
Citation Wilkinson, BLBornaghi, LFHouston, TAInnocenti, AVullo, DSupuran, CTPoulsen, SA Inhibition of membrane-associated carbonic anhydrase isozymes IX, XII and XIV with a library of glycoconjugate benzenesulfonamides. Bioorg Med Chem Lett17:987-92 (2007) 
 
Carbonic anhydrase 14
Name:Carbonic anhydrase 14
Type:Enzyme
Mol. Mass.:37665.67
Organism:Homo sapiens (Human)
Description:Human (cloned) isozyme.
Residue:337
BDBM12924
NameBDBM12924
Synonyms:4-({[4-(Aminosulfonyl)benzoyl]oxy}methyl-1-(2,3,4,6-tetra-O-acetyl-beta-D-galactopyranosyl)-1H-1,2,3-triazole Glycoconjugate Benzene Sulfonamide 3b | {1-[(2R,3R,4S,5S,6R)-3,4,5-tris(acetyloxy)-6-[(acetyloxy)methyl]oxan-2-yl]-1H-1,2,3-triazol-4-yl}methyl 4-sulfamoylbenzoate
TypeSmall organic molecule
Emp. Form.C24H28N4O13S
Mol. Mass.612.563
SMILESCC(=O)OC[C@H]1O[C@H]([C@H](OC(C)=O)[C@@H](OC(C)=O)[C@H]1OC(C)=O)n1cc(COC(=O)c2ccc(cc2)S(N)(=O)=O)nn1