Reaction Details
TargetCarbonic anhydrase 12
LigandBDBM50200449
Substrate/Competitorn/a
Meas. Tech.ChEMBL_441219 (CHEMBL891443)
Ki 7.6±n/a nM
Citation Wilkinson, BLBornaghi, LFHouston, TAInnocenti, AVullo, DSupuran, CTPoulsen, SA Inhibition of membrane-associated carbonic anhydrase isozymes IX, XII and XIV with a library of glycoconjugate benzenesulfonamides. Bioorg Med Chem Lett17:987-92 (2007) 
 
Carbonic anhydrase 12
Name:Carbonic anhydrase 12
Type:Enzyme
Mol. Mass.:39456.00
Organism:Homo sapiens (Human)
Description:Catalytic domain of human cloned isozyme was used in the assay
Residue:354
BDBM50200449
NameBDBM50200449
Synonyms:4-sulfamoyl-benzoic acid 1-((2S,3S,4R,5R)-3,4,5-triacetoxy-tetrahydro-pyran-2-yl)-1H-[1,2,3]triazol-4-ylmethyl ester | CHEMBL231897
TypeSmall organic molecule
Emp. Form.C21H24N4O11S
Mol. Mass.540.5
SMILESCC(=O)O[C@@H]1CO[C@@H]([C@@H](OC(C)=O)[C@@H]1OC(C)=O)n1cc(COC(=O)c2ccc(cc2)S(N)(=O)=O)nn1