Reaction Details
TargetCarbonic anhydrase 12
LigandBDBM12919
Substrate/Competitorn/a
Meas. Tech.ChEMBL_441219 (CHEMBL891443)
Ki 11.4±n/a nM
Citation Wilkinson, BLBornaghi, LFHouston, TAInnocenti, AVullo, DSupuran, CTPoulsen, SA Inhibition of membrane-associated carbonic anhydrase isozymes IX, XII and XIV with a library of glycoconjugate benzenesulfonamides. Bioorg Med Chem Lett17:987-92 (2007) 
 
Carbonic anhydrase 12
Name:Carbonic anhydrase 12
Type:Enzyme
Mol. Mass.:39456.00
Organism:Homo sapiens (Human)
Description:Catalytic domain of human cloned isozyme was used in the assay
Residue:354
BDBM12919
NameBDBM12919
Synonyms:4-({[4-(Aminosulfonyl)benzoyl]amino}methyl-1-(beta-D-glucopyranosyl)-1H-1,2,3-triazole CHEMBL385152 | Glycoconjugate Benzene Sulfonamide 2aa
TypeSmall organic molecule
Emp. Form.C16H21N5O8S
Mol. Mass.443.432
SMILESNS(=O)(=O)c1ccc(cc1)C(=O)NCc1cn(nn1)[C@@H]1O[C@H](CO)[C@@H](O)[C@H](O)[C@H]1O