Reaction Details
TargetCarbonic anhydrase 14
LigandBDBM12931
Substrate/Competitorn/a
Meas. Tech.ChEMBL_441220 (CHEMBL891444)
Ki 103±n/a nM
Citation Wilkinson, BLBornaghi, LFHouston, TAInnocenti, AVullo, DSupuran, CTPoulsen, SA Inhibition of membrane-associated carbonic anhydrase isozymes IX, XII and XIV with a library of glycoconjugate benzenesulfonamides. Bioorg Med Chem Lett17:987-92 (2007) 
 
Carbonic anhydrase 14
Name:Carbonic anhydrase 14
Type:Enzyme
Mol. Mass.:37665.67
Organism:Homo sapiens (Human)
Description:Human (cloned) isozyme.
Residue:337
BDBM12931
NameBDBM12931
Synonyms:4-({[4-(Aminosulfonyl)benzoyl]amino}methyl-1-(2-acetamido-2-deoxy-beta-D-glucopyranosyl)-1H-1,2,3-triazole Glycoconjugate Benzene Sulfonamide 2dd | N-({1-[(2R,3R,4R,5S,6R)-3-acetamido-4,5-dihydroxy-6-(hydroxymethyl)oxan-2-yl]-1H-1,2,3-triazol-4-yl}methyl)-4-sulfamoylbenzamide
TypeSmall organic molecule
Emp. Form.C18H24N6O8S
Mol. Mass.484.484
SMILESCC(=O)N[C@@H]1[C@@H](O)[C@H](O)[C@@H](CO)O[C@H]1n1cc(CNC(=O)c2ccc(cc2)S(N)(=O)=O)nn1