Reaction Details
TargetCarbonic anhydrase 12
LigandBDBM12932
Substrate/Competitorn/a
Meas. Tech.ChEMBL_441219 (CHEMBL891443)
Ki 3.9±n/a nM
Citation Wilkinson, BLBornaghi, LFHouston, TAInnocenti, AVullo, DSupuran, CTPoulsen, SA Inhibition of membrane-associated carbonic anhydrase isozymes IX, XII and XIV with a library of glycoconjugate benzenesulfonamides. Bioorg Med Chem Lett17:987-92 (2007) 
 
Carbonic anhydrase 12
Name:Carbonic anhydrase 12
Type:Enzyme
Mol. Mass.:39456.00
Organism:Homo sapiens (Human)
Description:Catalytic domain of human cloned isozyme was used in the assay
Residue:354
BDBM12932
NameBDBM12932
Synonyms:4-({[4-(Aminosulfonyl)benzoyl]oxy}methyl-1-(2-acetamido-2-deoxy-3,4,6-tri-O-acetyl-beta-D-glucopyranosyl)-1H-1,2,3-tria Glycoconjugate Benzene Sulfonamide 3d | {1-[(2R,3R,4R,5S,6R)-3-acetamido-4,5-bis(acetyloxy)-6-[(acetyloxy)methyl]oxan-2-yl]-1H-1,2,3-triazol-4-yl}methyl 4-sulfamoylbenzoate
TypeSmall organic molecule
Emp. Form.C24H29N5O12S
Mol. Mass.611.578
SMILESCC(=O)N[C@@H]1[C@@H](OC(C)=O)[C@H](OC(C)=O)[C@@H](COC(C)=O)O[C@H]1n1cc(COC(=O)c2ccc(cc2)S(N)(=O)=O)nn1