Reaction Details
TargetCarbonic anhydrase 14
LigandBDBM12930
Substrate/Competitorn/a
Meas. Tech.ChEMBL_441220 (CHEMBL891444)
Ki 78±n/a nM
Citation Wilkinson, BLBornaghi, LFHouston, TAInnocenti, AVullo, DSupuran, CTPoulsen, SA Inhibition of membrane-associated carbonic anhydrase isozymes IX, XII and XIV with a library of glycoconjugate benzenesulfonamides. Bioorg Med Chem Lett17:987-92 (2007) 
 
Carbonic anhydrase 14
Name:Carbonic anhydrase 14
Type:Enzyme
Mol. Mass.:37665.67
Organism:Homo sapiens (Human)
Description:Human (cloned) isozyme.
Residue:337
BDBM12930
NameBDBM12930
Synonyms:4-({[4-(Aminosulfonyl)benzoyl]amino}methyl-1-(2-acetamido-2-deoxy-3,4,6-tri-O-acetyl-beta-D-glucopyranosyl)-1H-1,2,3-triazole Glycoconjugate Benzene Sulfonamide 2d | [(2R,3S,4R,5R,6R)-5-acetamido-3,4-bis(acetyloxy)-6-(4-{[(4-sulfamoylphenyl)formamido]methyl}-1H-1,2,3-triazol-1-yl)oxan-2-yl]methyl acetate
TypeSmall organic molecule
Emp. Form.C24H30N6O11S
Mol. Mass.610.594
SMILESCC(=O)N[C@@H]1[C@@H](OC(C)=O)[C@H](OC(C)=O)[C@@H](COC(C)=O)O[C@H]1n1cc(CNC(=O)c2ccc(cc2)S(N)(=O)=O)nn1