Reaction Details
TargetApoptosis regulator Bcl-2
LigandBDBM50202269
Substrate/Competitorn/a
Meas. Tech.ChEMBL_441637 (CHEMBL891868)
Ki 2850±n/a nM
Citation Xing, CWang, LTang, XSham, YY Development of selective inhibitors for anti-apoptotic Bcl-2 proteins from BHI-1. Bioorg Med Chem15:2167-76 (2007) 
 
Apoptosis regulator Bcl-2
Name:Apoptosis regulator Bcl-2
Type:Homodimer or heterodimer
Mol. Mass.:26269.11
Organism:Homo sapiens (Human)
Description:P10415
Residue:239
BDBM50202269
NameBDBM50202269
Synonyms:2-[5-(4-bromobenzylidene)-4-oxo-2-thioxothiazolidin-3-yl]-3-(3-indolyl)-propanoic acid | CHEMBL242969
TypeSmall organic molecule
Emp. Form.C21H15BrN2O3S2
Mol. Mass.487.389
SMILESOC(=O)[C@H](Cc1c[nH]c2ccccc12)N1C(=S)S\C(=C/c2ccc(Br)cc2)C1=O