Reaction Details
TargetBcl-2-like protein 2
LigandBDBM50202271
Substrate/Competitorn/a
Meas. Tech.ChEMBL_441639 (CHEMBL891870)
Ki 6980±n/a nM
Citation Xing, CWang, LTang, XSham, YY Development of selective inhibitors for anti-apoptotic Bcl-2 proteins from BHI-1. Bioorg Med Chem15:2167-76 (2007) 
 
Bcl-2-like protein 2
Name:Bcl-2-like protein 2
Type:Protein
Mol. Mass.:20742.61
Organism:Homo sapiens (Human)
Description:n/a
Residue:193
BDBM50202271
NameBDBM50202271
Synonyms:2-[5-(phenyl(4-biphenyl)methylidene)-4-oxo-2-thioxothiazolidin-3-yl]-4-methylpentanoic acid | CHEMBL242340
TypeSmall organic molecule
Emp. Form.C28H25NO3S2
Mol. Mass.487.633
SMILESCC(C)C[C@H](N1C(=S)S\C(=C(\c2ccccc2)c2ccc(cc2)-c2ccccc2)C1=O)C(O)=O