Reaction Details
TargetBcl-2-like protein 2
LigandBDBM50202283
Substrate/Competitorn/a
Meas. Tech.ChEMBL_441639 (CHEMBL891870)
Ki 31200±n/a nM
Citation Xing, CWang, LTang, XSham, YY Development of selective inhibitors for anti-apoptotic Bcl-2 proteins from BHI-1. Bioorg Med Chem15:2167-76 (2007) 
 
Bcl-2-like protein 2
Name:Bcl-2-like protein 2
Type:Protein
Mol. Mass.:20742.61
Organism:Homo sapiens (Human)
Description:n/a
Residue:193
BDBM50202283
NameBDBM50202283
Synonyms:2-[5-(4-bromobenzylidene)-4-oxo-2-thioxothiazolidin-3-yl]-4-methylpentanoic acid | CHEMBL397906
TypeSmall organic molecule
Emp. Form.C16H16BrNO3S2
Mol. Mass.414.337
SMILESCC(C)C[C@H](N1C(=S)S\C(=C/c2ccc(Br)cc2)C1=O)C(O)=O