Reaction Details
TargetBcl-2-like protein 2
LigandBDBM50202280
Substrate/Competitorn/a
Meas. Tech.ChEMBL_441639 (CHEMBL891870)
Ki 124000±n/a nM
Citation Xing, CWang, LTang, XSham, YY Development of selective inhibitors for anti-apoptotic Bcl-2 proteins from BHI-1. Bioorg Med Chem15:2167-76 (2007) 
 
Bcl-2-like protein 2
Name:Bcl-2-like protein 2
Type:Protein
Mol. Mass.:20742.61
Organism:Homo sapiens (Human)
Description:n/a
Residue:193
BDBM50202280
NameBDBM50202280
Synonyms:2-[5-(4-bromobenzylidene)-4-oxo-2-thioxothiazolidin-3-yl]-3-methylbutanoic acid | CHEMBL241895
TypeSmall organic molecule
Emp. Form.C15H14BrNO3S2
Mol. Mass.400.311
SMILESCC(C)C(N1C(=S)S\C(=C\c2ccc(Br)cc2)C1=O)C(O)=O